食品分類,資料類別,整合編號,樣品名稱,俗名,樣品英文名稱,內容物描述,廢棄率,分析項分類,分析項,含量單位,每100克含量,樣本數,標準差,每單位含量,每單位重,每單位重含量
加工調理食品及其他類,樣品基本資料,R2300301,冷凍芋泥包,,Taro paste bun,"冷凍包裝,混合均勻打碎(麵粉,芋頭等)",0.0,糖質分析,半乳糖,g,0.0,1,,0.0,71.0克,0.0
加工調理食品及其他類,樣品基本資料,R2300301,冷凍芋泥包,,Taro paste bun,"冷凍包裝,混合均勻打碎(麵粉,芋頭等)",0.0,胺基酸組成,甘胺酸(Gly),mg,236,2,8.0000,236,71.0克,168
加工調理食品及其他類,樣品基本資料,R2300301,冷凍芋泥包,,Taro paste bun,"冷凍包裝,混合均勻打碎(麵粉,芋頭等)",0.0,胺基酸組成,甲硫胺酸(Met),mg,55,2,68.0000,55,71.0克,39
加工調理食品及其他類,樣品基本資料,R2300301,冷凍芋泥包,,Taro paste bun,"冷凍包裝,混合均勻打碎(麵粉,芋頭等)",0.0,胺基酸組成,白胺酸(Leu),mg,457,2,34.0000,457,71.0克,324
加工調理食品及其他類,樣品基本資料,R2300301,冷凍芋泥包,,Taro paste bun,"冷凍包裝,混合均勻打碎(麵粉,芋頭等)",0.0,脂肪酸組成,次亞麻油酸(18:3),mg,104,3,,104,71.0克,74
加工調理食品及其他類,樣品基本資料,R2300301,冷凍芋泥包,,Taro paste bun,"冷凍包裝,混合均勻打碎(麵粉,芋頭等)",0.0,一般成分,灰分,g,0.5,2,0.0000,0.5,71.0克,0.4
加工調理食品及其他類,樣品基本資料,R2300301,冷凍芋泥包,,Taro paste bun,"冷凍包裝,混合均勻打碎(麵粉,芋頭等)",0.0,脂肪酸組成,肉豆蔻烯酸(14:1),mg,0,3,,0,71.0克,0
加工調理食品及其他類,樣品基本資料,R2300301,冷凍芋泥包,,Taro paste bun,"冷凍包裝,混合均勻打碎(麵粉,芋頭等)",0.0,脂肪酸組成,肉豆蔻酸(14:0),mg,51,3,,51,71.0克,36
加工調理食品及其他類,樣品基本資料,R2300301,冷凍芋泥包,,Taro paste bun,"冷凍包裝,混合均勻打碎(麵粉,芋頭等)",0.0,胺基酸組成,色胺酸(Trp),mg,45,2,1.0000,45,71.0克,32
加工調理食品及其他類,樣品基本資料,R2300301,冷凍芋泥包,,Taro paste bun,"冷凍包裝,混合均勻打碎(麵粉,芋頭等)",0.0,脂肪酸組成,辛酸(8:0),mg,5,3,,5,71.0克,4
加工調理食品及其他類,樣品基本資料,R2300301,冷凍芋泥包,,Taro paste bun,"冷凍包裝,混合均勻打碎(麵粉,芋頭等)",0.0,糖質分析,乳糖,g,0.0,1,,0.0,71.0克,0.0
加工調理食品及其他類,樣品基本資料,R2300301,冷凍芋泥包,,Taro paste bun,"冷凍包裝,混合均勻打碎(麵粉,芋頭等)",0.0,脂肪酸組成,亞麻油酸(18:2),mg,1056,3,,1056,71.0克,750
加工調理食品及其他類,樣品基本資料,R2300301,冷凍芋泥包,,Taro paste bun,"冷凍包裝,混合均勻打碎(麵粉,芋頭等)",0.0,脂肪酸組成,其他脂肪酸,mg,0,1,,0,71.0克,0
加工調理食品及其他類,樣品基本資料,R2300301,冷凍芋泥包,,Taro paste bun,"冷凍包裝,混合均勻打碎(麵粉,芋頭等)",0.0,糖質分析,果糖,g,1.0,1,,1.0,71.0克,0.7
加工調理食品及其他類,樣品基本資料,R2300301,冷凍芋泥包,,Taro paste bun,"冷凍包裝,混合均勻打碎(麵粉,芋頭等)",0.0,脂肪酸組成,油酸(18:1),mg,1028,3,,1028,71.0克,730
加工調理食品及其他類,樣品基本資料,R2300301,冷凍芋泥包,,Taro paste bun,"冷凍包裝,混合均勻打碎(麵粉,芋頭等)",0.0,脂肪酸組成,花生油酸(20:4),mg,0,3,,0,71.0克,0
加工調理食品及其他類,樣品基本資料,R2300301,冷凍芋泥包,,Taro paste bun,"冷凍包裝,混合均勻打碎(麵粉,芋頭等)",0.0,脂肪酸組成,花生酸(20:0),mg,12,3,,12,71.0克,9
加工調理食品及其他類,樣品基本資料,R2300301,冷凍芋泥包,,Taro paste bun,"冷凍包裝,混合均勻打碎(麵粉,芋頭等)",0.0,脂肪酸組成,芥子酸(22:1),mg,3,3,,3,71.0克,2
加工調理食品及其他類,樣品基本資料,R2300301,冷凍芋泥包,,Taro paste bun,"冷凍包裝,混合均勻打碎(麵粉,芋頭等)",0.0,脂肪酸組成,癸酸(10:0),mg,7,3,,7,71.0克,5
加工調理食品及其他類,樣品基本資料,R2300301,冷凍芋泥包,,Taro paste bun,"冷凍包裝,混合均勻打碎(麵粉,芋頭等)",0.0,胺基酸組成,苯丙胺酸(Phe),mg,312,2,34.0000,312,71.0克,222
加工調理食品及其他類,樣品基本資料,R2300301,冷凍芋泥包,,Taro paste bun,"冷凍包裝,混合均勻打碎(麵粉,芋頭等)",0.0,一般成分,修正熱量,kcal,258,,,258,71.0克,183
加工調理食品及其他類,樣品基本資料,R2300301,冷凍芋泥包,,Taro paste bun,"冷凍包裝,混合均勻打碎(麵粉,芋頭等)",0.0,胺基酸組成,胱胺酸(Cys),mg,203,2,21.0000,203,71.0克,144
加工調理食品及其他類,樣品基本資料,R2300301,冷凍芋泥包,,Taro paste bun,"冷凍包裝,混合均勻打碎(麵粉,芋頭等)",0.0,脂肪酸組成,脂肪酸M總量,mg,1043,,,1043,71.0克,741
加工調理食品及其他類,樣品基本資料,R2300301,冷凍芋泥包,,Taro paste bun,"冷凍包裝,混合均勻打碎(麵粉,芋頭等)",0.0,脂肪酸組成,脂肪酸P總量,mg,1160,,,1160,71.0克,824
加工調理食品及其他類,樣品基本資料,R2300301,冷凍芋泥包,,Taro paste bun,"冷凍包裝,混合均勻打碎(麵粉,芋頭等)",0.0,脂肪酸組成,脂肪酸S總量,mg,1351,,,1351,71.0克,959
加工調理食品及其他類,樣品基本資料,R2300301,冷凍芋泥包,,Taro paste bun,"冷凍包裝,混合均勻打碎(麵粉,芋頭等)",0.0,其他,酒精含量,g,,0,,,71.0克,
加工調理食品及其他類,樣品基本資料,R2300301,冷凍芋泥包,,Taro paste bun,"冷凍包裝,混合均勻打碎(麵粉,芋頭等)",0.0,胺基酸組成,異白胺酸(Ile),mg,239,2,31.0000,239,71.0克,170
加工調理食品及其他類,樣品基本資料,R2300301,冷凍芋泥包,,Taro paste bun,"冷凍包裝,混合均勻打碎(麵粉,芋頭等)",0.0,一般成分,粗脂肪,g,3.6,3,1.1000,3.6,71.0克,2.6
加工調理食品及其他類,樣品基本資料,R2300301,冷凍芋泥包,,Taro paste bun,"冷凍包裝,混合均勻打碎(麵粉,芋頭等)",0.0,一般成分,粗蛋白,g,6.6,2,0.5000,6.6,71.0克,4.7
加工調理食品及其他類,樣品基本資料,R2300301,冷凍芋泥包,,Taro paste bun,"冷凍包裝,混合均勻打碎(麵粉,芋頭等)",0.0,胺基酸組成,組胺酸(His),mg,148,2,15.0000,148,71.0克,105
加工調理食品及其他類,樣品基本資料,R2300301,冷凍芋泥包,,Taro paste bun,"冷凍包裝,混合均勻打碎(麵粉,芋頭等)",0.0,胺基酸組成,脯胺酸(Pro),mg,790,2,5.0000,790,71.0克,561
加工調理食品及其他類,樣品基本資料,R2300301,冷凍芋泥包,,Taro paste bun,"冷凍包裝,混合均勻打碎(麵粉,芋頭等)",0.0,糖質分析,麥芽糖,g,1.5,1,,1.5,71.0克,1.1
加工調理食品及其他類,樣品基本資料,R2300301,冷凍芋泥包,,Taro paste bun,"冷凍包裝,混合均勻打碎(麵粉,芋頭等)",0.0,脂肪酸組成,棕櫚烯酸(16:1),mg,8,3,,8,71.0克,6
加工調理食品及其他類,樣品基本資料,R2300301,冷凍芋泥包,,Taro paste bun,"冷凍包裝,混合均勻打碎(麵粉,芋頭等)",0.0,脂肪酸組成,棕櫚酸(16:0),mg,1021,3,,1021,71.0克,725
加工調理食品及其他類,樣品基本資料,R2300301,冷凍芋泥包,,Taro paste bun,"冷凍包裝,混合均勻打碎(麵粉,芋頭等)",0.0,脂肪酸組成,硬脂酸(18:0),mg,197,3,,197,71.0克,140
加工調理食品及其他類,樣品基本資料,R2300301,冷凍芋泥包,,Taro paste bun,"冷凍包裝,混合均勻打碎(麵粉,芋頭等)",0.0,胺基酸組成,絲胺酸(Ser),mg,288,2,25.0000,288,71.0克,204
加工調理食品及其他類,樣品基本資料,R2300301,冷凍芋泥包,,Taro paste bun,"冷凍包裝,混合均勻打碎(麵粉,芋頭等)",0.0,維生素B群 & C,菸鹼素,mg,0.56,2,0.0800,0.56,71.0克,0.40
加工調理食品及其他類,樣品基本資料,R2300301,冷凍芋泥包,,Taro paste bun,"冷凍包裝,混合均勻打碎(麵粉,芋頭等)",0.0,維生素A,視網醇,ug,,0,,,71.0克,
加工調理食品及其他類,樣品基本資料,R2300301,冷凍芋泥包,,Taro paste bun,"冷凍包裝,混合均勻打碎(麵粉,芋頭等)",0.0,維生素A,視網醇當量(RE),ug,1,,,1,71.0克,1
加工調理食品及其他類,樣品基本資料,R2300301,冷凍芋泥包,,Taro paste bun,"冷凍包裝,混合均勻打碎(麵粉,芋頭等)",0.0,胺基酸組成,酥胺酸(Thr),mg,180,2,6.0000,180,71.0克,128
加工調理食品及其他類,樣品基本資料,R2300301,冷凍芋泥包,,Taro paste bun,"冷凍包裝,混合均勻打碎(麵粉,芋頭等)",0.0,礦物質,鈣,mg,16,2,11.0000,16,71.0克,11
加工調理食品及其他類,樣品基本資料,R2300301,冷凍芋泥包,,Taro paste bun,"冷凍包裝,混合均勻打碎(麵粉,芋頭等)",0.0,礦物質,鈉,mg,46,2,14.0000,46,71.0克,33
加工調理食品及其他類,樣品基本資料,R2300301,冷凍芋泥包,,Taro paste bun,"冷凍包裝,混合均勻打碎(麵粉,芋頭等)",0.0,維生素B群 & C,葉酸,ug,22.8,1,,22.8,71.0克,16.2
加工調理食品及其他類,樣品基本資料,R2300301,冷凍芋泥包,,Taro paste bun,"冷凍包裝,混合均勻打碎(麵粉,芋頭等)",0.0,糖質分析,葡萄糖,g,1.0,1,,1.0,71.0克,0.7
加工調理食品及其他類,樣品基本資料,R2300301,冷凍芋泥包,,Taro paste bun,"冷凍包裝,混合均勻打碎(麵粉,芋頭等)",0.0,胺基酸組成,酪胺酸(Tyr),mg,192,2,47.0000,192,71.0克,136
加工調理食品及其他類,樣品基本資料,R2300301,冷凍芋泥包,,Taro paste bun,"冷凍包裝,混合均勻打碎(麵粉,芋頭等)",0.0,脂肪酸組成,酪酸(4:0),mg,0,3,,0,71.0克,0
加工調理食品及其他類,樣品基本資料,R2300301,冷凍芋泥包,,Taro paste bun,"冷凍包裝,混合均勻打碎(麵粉,芋頭等)",0.0,礦物質,鉀,mg,130,2,6.0000,130,71.0克,92
加工調理食品及其他類,樣品基本資料,R2300301,冷凍芋泥包,,Taro paste bun,"冷凍包裝,混合均勻打碎(麵粉,芋頭等)",0.0,一般成分,飽和脂肪,g,1.4,,,1.4,71.0克,1.0
加工調理食品及其他類,樣品基本資料,R2300301,冷凍芋泥包,,Taro paste bun,"冷凍包裝,混合均勻打碎(麵粉,芋頭等)",0.0,胺基酸組成,精胺酸(Arg),mg,264,2,59.0000,264,71.0克,187
加工調理食品及其他類,樣品基本資料,R2300301,冷凍芋泥包,,Taro paste bun,"冷凍包裝,混合均勻打碎(麵粉,芋頭等)",0.0,維生素A,維生素A總量(IU),I.U.,6,,,6,71.0克,4
加工調理食品及其他類,樣品基本資料,R2300301,冷凍芋泥包,,Taro paste bun,"冷凍包裝,混合均勻打碎(麵粉,芋頭等)",0.0,維生素B群 & C,維生素B1,mg,0.06,2,0.0000,0.06,71.0克,0.04
加工調理食品及其他類,樣品基本資料,R2300301,冷凍芋泥包,,Taro paste bun,"冷凍包裝,混合均勻打碎(麵粉,芋頭等)",0.0,維生素B群 & C,維生素B12,ug,,0,,,71.0克,
加工調理食品及其他類,樣品基本資料,R2300301,冷凍芋泥包,,Taro paste bun,"冷凍包裝,混合均勻打碎(麵粉,芋頭等)",0.0,維生素B群 & C,維生素B2,mg,0.06,2,0.0300,0.06,71.0克,0.04
加工調理食品及其他類,樣品基本資料,R2300301,冷凍芋泥包,,Taro paste bun,"冷凍包裝,混合均勻打碎(麵粉,芋頭等)",0.0,維生素B群 & C,維生素B6,mg,0.07,2,0.0400,0.07,71.0克,0.05
加工調理食品及其他類,樣品基本資料,R2300301,冷凍芋泥包,,Taro paste bun,"冷凍包裝,混合均勻打碎(麵粉,芋頭等)",0.0,維生素B群 & C,維生素C,mg,0.0,1,,0.0,71.0克,0.0
加工調理食品及其他類,樣品基本資料,R2300301,冷凍芋泥包,,Taro paste bun,"冷凍包裝,混合均勻打碎(麵粉,芋頭等)",0.0,維生素D,維生素D2,ug,,0,,,71.0克,
加工調理食品及其他類,樣品基本資料,R2300301,冷凍芋泥包,,Taro paste bun,"冷凍包裝,混合均勻打碎(麵粉,芋頭等)",0.0,維生素D,維生素D3,ug,,0,,,71.0克,
加工調理食品及其他類,樣品基本資料,R2300301,冷凍芋泥包,,Taro paste bun,"冷凍包裝,混合均勻打碎(麵粉,芋頭等)",0.0,維生素D,維生素D總量(IU),I.U.,,,,,71.0克,
加工調理食品及其他類,樣品基本資料,R2300301,冷凍芋泥包,,Taro paste bun,"冷凍包裝,混合均勻打碎(麵粉,芋頭等)",0.0,維生素D,維生素D總量(ug),ug,,,,,71.0克,
加工調理食品及其他類,樣品基本資料,R2300301,冷凍芋泥包,,Taro paste bun,"冷凍包裝,混合均勻打碎(麵粉,芋頭等)",0.0,維生素E,維生素E總量,mg,2.10,,,2.10,71.0克,1.49
加工調理食品及其他類,樣品基本資料,R2300301,冷凍芋泥包,,Taro paste bun,"冷凍包裝,混合均勻打碎(麵粉,芋頭等)",0.0,維生素K,維生素K1,ug,,0,,,71.0克,
加工調理食品及其他類,樣品基本資料,R2300301,冷凍芋泥包,,Taro paste bun,"冷凍包裝,混合均勻打碎(麵粉,芋頭等)",0.0,維生素K,維生素K2(MK-4),ug,,0,,,71.0克,
加工調理食品及其他類,樣品基本資料,R2300301,冷凍芋泥包,,Taro paste bun,"冷凍包裝,混合均勻打碎(麵粉,芋頭等)",0.0,維生素K,維生素K2(MK-7),ug,,0,,,71.0克,
加工調理食品及其他類,樣品基本資料,R2300301,冷凍芋泥包,,Taro paste bun,"冷凍包裝,混合均勻打碎(麵粉,芋頭等)",0.0,礦物質,銅,mg,,0,,,71.0克,
加工調理食品及其他類,樣品基本資料,R2300301,冷凍芋泥包,,Taro paste bun,"冷凍包裝,混合均勻打碎(麵粉,芋頭等)",0.0,一般成分,熱量,kcal,263,,,263,71.0克,187
加工調理食品及其他類,樣品基本資料,R2300301,冷凍芋泥包,,Taro paste bun,"冷凍包裝,混合均勻打碎(麵粉,芋頭等)",0.0,糖質分析,蔗糖,g,8.1,1,,8.1,71.0克,5.8
加工調理食品及其他類,樣品基本資料,R2300301,冷凍芋泥包,,Taro paste bun,"冷凍包裝,混合均勻打碎(麵粉,芋頭等)",0.0,礦物質,鋅,mg,0.7,2,0.1000,0.7,71.0克,0.5
加工調理食品及其他類,樣品基本資料,R2300301,冷凍芋泥包,,Taro paste bun,"冷凍包裝,混合均勻打碎(麵粉,芋頭等)",0.0,胺基酸組成,麩胺酸(Glu),mg,2110,2,180.0000,2110,71.0克,1498
加工調理食品及其他類,樣品基本資料,R2300301,冷凍芋泥包,,Taro paste bun,"冷凍包裝,混合均勻打碎(麵粉,芋頭等)",0.0,糖質分析,糖質總量,g,11.6,,,11.6,71.0克,8.2
加工調理食品及其他類,樣品基本資料,R2300301,冷凍芋泥包,,Taro paste bun,"冷凍包裝,混合均勻打碎(麵粉,芋頭等)",0.0,一般成分,膳食纖維,g,2.4,2,0.2000,2.4,71.0克,1.7
加工調理食品及其他類,樣品基本資料,R2300301,冷凍芋泥包,,Taro paste bun,"冷凍包裝,混合均勻打碎(麵粉,芋頭等)",0.0,礦物質,錳,mg,,0,,,71.0克,
加工調理食品及其他類,樣品基本資料,R2300301,冷凍芋泥包,,Taro paste bun,"冷凍包裝,混合均勻打碎(麵粉,芋頭等)",0.0,礦物質,磷,mg,223,2,215.0000,223,71.0克,158
加工調理食品及其他類,樣品基本資料,R2300301,冷凍芋泥包,,Taro paste bun,"冷凍包裝,混合均勻打碎(麵粉,芋頭等)",0.0,一般成分,總碳水化合物,g,51.1,,,51.1,71.0克,36.3
加工調理食品及其他類,樣品基本資料,R2300301,冷凍芋泥包,,Taro paste bun,"冷凍包裝,混合均勻打碎(麵粉,芋頭等)",0.0,其他,膽固醇,mg,0,1,,0,71.0克,0
加工調理食品及其他類,樣品基本資料,R2300301,冷凍芋泥包,,Taro paste bun,"冷凍包裝,混合均勻打碎(麵粉,芋頭等)",0.0,礦物質,鎂,mg,18,2,2.0000,18,71.0克,13
加工調理食品及其他類,樣品基本資料,R2300301,冷凍芋泥包,,Taro paste bun,"冷凍包裝,混合均勻打碎(麵粉,芋頭等)",0.0,胺基酸組成,離胺酸(Lys),mg,181,2,5.0000,181,71.0克,129
加工調理食品及其他類,樣品基本資料,R2300301,冷凍芋泥包,,Taro paste bun,"冷凍包裝,混合均勻打碎(麵粉,芋頭等)",0.0,礦物質,鐵,mg,0.5,2,0.1000,0.5,71.0克,0.4
加工調理食品及其他類,樣品基本資料,R2300301,冷凍芋泥包,,Taro paste bun,"冷凍包裝,混合均勻打碎(麵粉,芋頭等)",0.0,胺基酸組成,纈胺酸(Val),mg,274,2,33.0000,274,71.0克,195
加工調理食品及其他類,樣品基本資料,R2300301,冷凍芋泥包,,Taro paste bun,"冷凍包裝,混合均勻打碎(麵粉,芋頭等)",0.0,脂肪酸組成,鱈烯酸(20:1),mg,4,3,,4,71.0克,3
加工調理食品及其他類,樣品基本資料,R2300501,冷凍芝麻包,,Sesame bun,"冷凍包裝,混合均勻打碎(麵粉,芝麻粉等)",,脂肪酸組成,P/M/S,,1.00/1.63/1.57,0,,,48.0克,
加工調理食品及其他類,樣品基本資料,R2300501,冷凍芝麻包,,Sesame bun,"冷凍包裝,混合均勻打碎(麵粉,芝麻粉等)",,維生素E,α-生育酚,mg,0.78,1,,0.78,48.0克,0.37
加工調理食品及其他類,樣品基本資料,R2300501,冷凍芝麻包,,Sesame bun,"冷凍包裝,混合均勻打碎(麵粉,芝麻粉等)",,維生素A,α-胡蘿蔔素,ug,0,1,,0,48.0克,0
加工調理食品及其他類,樣品基本資料,R2300501,冷凍芝麻包,,Sesame bun,"冷凍包裝,混合均勻打碎(麵粉,芝麻粉等)",,維生素E,α-維生素E當量(α-TE),mg,12.68,,,12.68,48.0克,6.09
加工調理食品及其他類,樣品基本資料,R2300501,冷凍芝麻包,,Sesame bun,"冷凍包裝,混合均勻打碎(麵粉,芝麻粉等)",,維生素E,β-生育酚,mg,23.50,1,,23.50,48.0克,11.28
加工調理食品及其他類,樣品基本資料,R2300501,冷凍芝麻包,,Sesame bun,"冷凍包裝,混合均勻打碎(麵粉,芝麻粉等)",,維生素A,β-胡蘿蔔素,ug,0,1,,0,48.0克,0
加工調理食品及其他類,樣品基本資料,R2300501,冷凍芝麻包,,Sesame bun,"冷凍包裝,混合均勻打碎(麵粉,芝麻粉等)",,維生素E,γ-生育酚,mg,1.41,1,,1.41,48.0克,0.68
加工調理食品及其他類,樣品基本資料,R2300501,冷凍芝麻包,,Sesame bun,"冷凍包裝,混合均勻打碎(麵粉,芝麻粉等)",,維生素E,δ-生育酚,mg,0.14,1,,0.14,48.0克,0.07
加工調理食品及其他類,樣品基本資料,R2300501,冷凍芝麻包,,Sesame bun,"冷凍包裝,混合均勻打碎(麵粉,芝麻粉等)",,脂肪酸組成,十七酸(17:0),mg,43,2,,43,48.0克,21
加工調理食品及其他類,樣品基本資料,R2300501,冷凍芝麻包,,Sesame bun,"冷凍包裝,混合均勻打碎(麵粉,芝麻粉等)",,脂肪酸組成,十九酸(19:0),mg,0,2,,0,48.0克,0
加工調理食品及其他類,樣品基本資料,R2300501,冷凍芝麻包,,Sesame bun,"冷凍包裝,混合均勻打碎(麵粉,芝麻粉等)",,脂肪酸組成,十八碳四烯酸(18:4),mg,0,2,,0,48.0克,0
加工調理食品及其他類,樣品基本資料,R2300501,冷凍芝麻包,,Sesame bun,"冷凍包裝,混合均勻打碎(麵粉,芝麻粉等)",,脂肪酸組成,十三酸(13:0),mg,0,2,,0,48.0克,0
加工調理食品及其他類,樣品基本資料,R2300501,冷凍芝麻包,,Sesame bun,"冷凍包裝,混合均勻打碎(麵粉,芝麻粉等)",,脂肪酸組成,十五酸(15:0),mg,21,2,,21,48.0克,10
加工調理食品及其他類,樣品基本資料,R2300501,冷凍芝麻包,,Sesame bun,"冷凍包裝,混合均勻打碎(麵粉,芝麻粉等)",,脂肪酸組成,山酸(22:0),mg,14,2,,14,48.0克,7
加工調理食品及其他類,樣品基本資料,R2300501,冷凍芝麻包,,Sesame bun,"冷凍包裝,混合均勻打碎(麵粉,芝麻粉等)",,脂肪酸組成,己酸(6:0),mg,0,2,,0,48.0克,0
加工調理食品及其他類,樣品基本資料,R2300501,冷凍芝麻包,,Sesame bun,"冷凍包裝,混合均勻打碎(麵粉,芝麻粉等)",,其他,反式脂肪,mg,28.01,1,,28.01,48.0克,13.44
加工調理食品及其他類,樣品基本資料,R2300501,冷凍芝麻包,,Sesame bun,"冷凍包裝,混合均勻打碎(麵粉,芝麻粉等)",,胺基酸組成,天門冬胺酸(Asp),mg,334,1,,334,48.0克,160
加工調理食品及其他類,樣品基本資料,R2300501,冷凍芝麻包,,Sesame bun,"冷凍包裝,混合均勻打碎(麵粉,芝麻粉等)",,脂肪酸組成,廿二碳五烯酸(22:5),mg,0,2,,0,48.0克,0
加工調理食品及其他類,樣品基本資料,R2300501,冷凍芝麻包,,Sesame bun,"冷凍包裝,混合均勻打碎(麵粉,芝麻粉等)",,脂肪酸組成,廿二碳六烯酸(22:6),mg,0,2,,0,48.0克,0
加工調理食品及其他類,樣品基本資料,R2300501,冷凍芝麻包,,Sesame bun,"冷凍包裝,混合均勻打碎(麵粉,芝麻粉等)",,脂肪酸組成,廿四酸(24:0),mg,7,2,,7,48.0克,3
加工調理食品及其他類,樣品基本資料,R2300501,冷凍芝麻包,,Sesame bun,"冷凍包裝,混合均勻打碎(麵粉,芝麻粉等)",,脂肪酸組成,廿碳五烯酸(20:5),mg,0,2,,0,48.0克,0
加工調理食品及其他類,樣品基本資料,R2300501,冷凍芝麻包,,Sesame bun,"冷凍包裝,混合均勻打碎(麵粉,芝麻粉等)",,脂肪酸組成,月桂酸(12:0),mg,50,2,,50,48.0克,24
加工調理食品及其他類,樣品基本資料,R2300501,冷凍芝麻包,,Sesame bun,"冷凍包裝,混合均勻打碎(麵粉,芝麻粉等)",,一般成分,水分,g,28.8,1,,28.8,48.0克,13.8
加工調理食品及其他類,樣品基本資料,R2300501,冷凍芝麻包,,Sesame bun,"冷凍包裝,混合均勻打碎(麵粉,芝麻粉等)",,胺基酸組成,水解胺基酸總量,mg,7145,,,7145,48.0克,3430
加工調理食品及其他類,樣品基本資料,R2300501,冷凍芝麻包,,Sesame bun,"冷凍包裝,混合均勻打碎(麵粉,芝麻粉等)",,胺基酸組成,丙胺酸(Ala),mg,242,1,,242,48.0克,116
加工調理食品及其他類,樣品基本資料,R2300501,冷凍芝麻包,,Sesame bun,"冷凍包裝,混合均勻打碎(麵粉,芝麻粉等)",,糖質分析,半乳糖,g,0.0,1,,0.0,48.0克,0.0
加工調理食品及其他類,樣品基本資料,R2300501,冷凍芝麻包,,Sesame bun,"冷凍包裝,混合均勻打碎(麵粉,芝麻粉等)",,胺基酸組成,甘胺酸(Gly),mg,268,1,,268,48.0克,129
加工調理食品及其他類,樣品基本資料,R2300501,冷凍芝麻包,,Sesame bun,"冷凍包裝,混合均勻打碎(麵粉,芝麻粉等)",,胺基酸組成,甲硫胺酸(Met),mg,126,1,,126,48.0克,60
加工調理食品及其他類,樣品基本資料,R2300501,冷凍芝麻包,,Sesame bun,"冷凍包裝,混合均勻打碎(麵粉,芝麻粉等)",,胺基酸組成,白胺酸(Leu),mg,493,1,,493,48.0克,237
加工調理食品及其他類,樣品基本資料,R2300501,冷凍芝麻包,,Sesame bun,"冷凍包裝,混合均勻打碎(麵粉,芝麻粉等)",,脂肪酸組成,次亞麻油酸(18:3),mg,59,2,,59,48.0克,28
加工調理食品及其他類,樣品基本資料,R2300501,冷凍芝麻包,,Sesame bun,"冷凍包裝,混合均勻打碎(麵粉,芝麻粉等)",,一般成分,灰分,g,0.6,1,,0.6,48.0克,0.3
加工調理食品及其他類,樣品基本資料,R2300501,冷凍芝麻包,,Sesame bun,"冷凍包裝,混合均勻打碎(麵粉,芝麻粉等)",,脂肪酸組成,肉豆蔻烯酸(14:1),mg,0,2,,0,48.0克,0
加工調理食品及其他類,樣品基本資料,R2300501,冷凍芝麻包,,Sesame bun,"冷凍包裝,混合均勻打碎(麵粉,芝麻粉等)",,脂肪酸組成,肉豆蔻酸(14:0),mg,150,2,,150,48.0克,72
加工調理食品及其他類,樣品基本資料,R2300501,冷凍芝麻包,,Sesame bun,"冷凍包裝,混合均勻打碎(麵粉,芝麻粉等)",,胺基酸組成,色胺酸(Trp),mg,73,1,,73,48.0克,35
加工調理食品及其他類,樣品基本資料,R2300501,冷凍芝麻包,,Sesame bun,"冷凍包裝,混合均勻打碎(麵粉,芝麻粉等)",,脂肪酸組成,辛酸(8:0),mg,6,2,,6,48.0克,3
加工調理食品及其他類,樣品基本資料,R2300501,冷凍芝麻包,,Sesame bun,"冷凍包裝,混合均勻打碎(麵粉,芝麻粉等)",,糖質分析,乳糖,g,0.0,1,,0.0,48.0克,0.0
加工調理食品及其他類,樣品基本資料,R2300501,冷凍芝麻包,,Sesame bun,"冷凍包裝,混合均勻打碎(麵粉,芝麻粉等)",,脂肪酸組成,亞麻油酸(18:2),mg,2716,2,,2716,48.0克,1304
加工調理食品及其他類,樣品基本資料,R2300501,冷凍芝麻包,,Sesame bun,"冷凍包裝,混合均勻打碎(麵粉,芝麻粉等)",,脂肪酸組成,其他脂肪酸,mg,27,1,,27,48.0克,13
加工調理食品及其他類,樣品基本資料,R2300501,冷凍芝麻包,,Sesame bun,"冷凍包裝,混合均勻打碎(麵粉,芝麻粉等)",,糖質分析,果糖,g,0.9,1,,0.9,48.0克,0.4
加工調理食品及其他類,樣品基本資料,R2300501,冷凍芝麻包,,Sesame bun,"冷凍包裝,混合均勻打碎(麵粉,芝麻粉等)",,脂肪酸組成,油酸(18:1),mg,4435,2,,4435,48.0克,2129
加工調理食品及其他類,樣品基本資料,R2300501,冷凍芝麻包,,Sesame bun,"冷凍包裝,混合均勻打碎(麵粉,芝麻粉等)",,脂肪酸組成,花生油酸(20:4),mg,0,2,,0,48.0克,0
加工調理食品及其他類,樣品基本資料,R2300501,冷凍芝麻包,,Sesame bun,"冷凍包裝,混合均勻打碎(麵粉,芝麻粉等)",,脂肪酸組成,花生酸(20:0),mg,48,2,,48,48.0克,23
加工調理食品及其他類,樣品基本資料,R2300501,冷凍芝麻包,,Sesame bun,"冷凍包裝,混合均勻打碎(麵粉,芝麻粉等)",,脂肪酸組成,芥子酸(22:1),mg,0,2,,0,48.0克,0
加工調理食品及其他類,樣品基本資料,R2300501,冷凍芝麻包,,Sesame bun,"冷凍包裝,混合均勻打碎(麵粉,芝麻粉等)",,脂肪酸組成,癸酸(10:0),mg,4,2,,4,48.0克,2
加工調理食品及其他類,樣品基本資料,R2300501,冷凍芝麻包,,Sesame bun,"冷凍包裝,混合均勻打碎(麵粉,芝麻粉等)",,胺基酸組成,苯丙胺酸(Phe),mg,352,1,,352,48.0克,169
加工調理食品及其他類,樣品基本資料,R2300501,冷凍芝麻包,,Sesame bun,"冷凍包裝,混合均勻打碎(麵粉,芝麻粉等)",,一般成分,修正熱量,kcal,340,,,340,48.0克,163
加工調理食品及其他類,樣品基本資料,R2300501,冷凍芝麻包,,Sesame bun,"冷凍包裝,混合均勻打碎(麵粉,芝麻粉等)",,胺基酸組成,胱胺酸(Cys),mg,17,1,,17,48.0克,8
加工調理食品及其他類,樣品基本資料,R2300501,冷凍芝麻包,,Sesame bun,"冷凍包裝,混合均勻打碎(麵粉,芝麻粉等)",,脂肪酸組成,脂肪酸M總量,mg,4535,,,4535,48.0克,2177
加工調理食品及其他類,樣品基本資料,R2300501,冷凍芝麻包,,Sesame bun,"冷凍包裝,混合均勻打碎(麵粉,芝麻粉等)",,脂肪酸組成,脂肪酸P總量,mg,2775,,,2775,48.0克,1332
加工調理食品及其他類,樣品基本資料,R2300501,冷凍芝麻包,,Sesame bun,"冷凍包裝,混合均勻打碎(麵粉,芝麻粉等)",,脂肪酸組成,脂肪酸S總量,mg,4355,,,4355,48.0克,2090
加工調理食品及其他類,樣品基本資料,R2300501,冷凍芝麻包,,Sesame bun,"冷凍包裝,混合均勻打碎(麵粉,芝麻粉等)",,其他,酒精含量,g,,0,,,48.0克,
加工調理食品及其他類,樣品基本資料,R2300501,冷凍芝麻包,,Sesame bun,"冷凍包裝,混合均勻打碎(麵粉,芝麻粉等)",,胺基酸組成,異白胺酸(Ile),mg,226,1,,226,48.0克,108
加工調理食品及其他類,樣品基本資料,R2300501,冷凍芝麻包,,Sesame bun,"冷凍包裝,混合均勻打碎(麵粉,芝麻粉等)",,一般成分,粗脂肪,g,11.7,2,3.3000,11.7,48.0克,5.6
加工調理食品及其他類,樣品基本資料,R2300501,冷凍芝麻包,,Sesame bun,"冷凍包裝,混合均勻打碎(麵粉,芝麻粉等)",,一般成分,粗蛋白,g,7.2,1,,7.2,48.0克,3.5
加工調理食品及其他類,樣品基本資料,R2300501,冷凍芝麻包,,Sesame bun,"冷凍包裝,混合均勻打碎(麵粉,芝麻粉等)",,胺基酸組成,組胺酸(His),mg,159,1,,159,48.0克,76
加工調理食品及其他類,樣品基本資料,R2300501,冷凍芝麻包,,Sesame bun,"冷凍包裝,混合均勻打碎(麵粉,芝麻粉等)",,胺基酸組成,脯胺酸(Pro),mg,828,1,,828,48.0克,397
加工調理食品及其他類,樣品基本資料,R2300501,冷凍芝麻包,,Sesame bun,"冷凍包裝,混合均勻打碎(麵粉,芝麻粉等)",,糖質分析,麥芽糖,g,1.0,1,,1.0,48.0克,0.5
加工調理食品及其他類,樣品基本資料,R2300501,冷凍芝麻包,,Sesame bun,"冷凍包裝,混合均勻打碎(麵粉,芝麻粉等)",,脂肪酸組成,棕櫚烯酸(16:1),mg,88,2,,88,48.0克,42
加工調理食品及其他類,樣品基本資料,R2300501,冷凍芝麻包,,Sesame bun,"冷凍包裝,混合均勻打碎(麵粉,芝麻粉等)",,脂肪酸組成,棕櫚酸(16:0),mg,2977,2,,2977,48.0克,1429
加工調理食品及其他類,樣品基本資料,R2300501,冷凍芝麻包,,Sesame bun,"冷凍包裝,混合均勻打碎(麵粉,芝麻粉等)",,脂肪酸組成,硬脂酸(18:0),mg,1035,2,,1035,48.0克,497
加工調理食品及其他類,樣品基本資料,R2300501,冷凍芝麻包,,Sesame bun,"冷凍包裝,混合均勻打碎(麵粉,芝麻粉等)",,胺基酸組成,絲胺酸(Ser),mg,353,1,,353,48.0克,169
加工調理食品及其他類,樣品基本資料,R2300501,冷凍芝麻包,,Sesame bun,"冷凍包裝,混合均勻打碎(麵粉,芝麻粉等)",,維生素B群 & C,菸鹼素,mg,0.70,1,,0.70,48.0克,0.34
加工調理食品及其他類,樣品基本資料,R2300501,冷凍芝麻包,,Sesame bun,"冷凍包裝,混合均勻打碎(麵粉,芝麻粉等)",,維生素A,視網醇,ug,,0,,,48.0克,
加工調理食品及其他類,樣品基本資料,R2300501,冷凍芝麻包,,Sesame bun,"冷凍包裝,混合均勻打碎(麵粉,芝麻粉等)",,維生素A,視網醇當量(RE),ug,0,,,0,48.0克,0
加工調理食品及其他類,樣品基本資料,R2300501,冷凍芝麻包,,Sesame bun,"冷凍包裝,混合均勻打碎(麵粉,芝麻粉等)",,胺基酸組成,酥胺酸(Thr),mg,207,1,,207,48.0克,99
加工調理食品及其他類,樣品基本資料,R2300501,冷凍芝麻包,,Sesame bun,"冷凍包裝,混合均勻打碎(麵粉,芝麻粉等)",,礦物質,鈣,mg,4,1,,4,48.0克,2
加工調理食品及其他類,樣品基本資料,R2300501,冷凍芝麻包,,Sesame bun,"冷凍包裝,混合均勻打碎(麵粉,芝麻粉等)",,礦物質,鈉,mg,24,1,,24,48.0克,12
加工調理食品及其他類,樣品基本資料,R2300501,冷凍芝麻包,,Sesame bun,"冷凍包裝,混合均勻打碎(麵粉,芝麻粉等)",,維生素B群 & C,葉酸,ug,,0,,,48.0克,
加工調理食品及其他類,樣品基本資料,R2300501,冷凍芝麻包,,Sesame bun,"冷凍包裝,混合均勻打碎(麵粉,芝麻粉等)",,糖質分析,葡萄糖,g,0.9,1,,0.9,48.0克,0.4
加工調理食品及其他類,樣品基本資料,R2300501,冷凍芝麻包,,Sesame bun,"冷凍包裝,混合均勻打碎(麵粉,芝麻粉等)",,胺基酸組成,酪胺酸(Tyr),mg,226,1,,226,48.0克,108
加工調理食品及其他類,樣品基本資料,R2300501,冷凍芝麻包,,Sesame bun,"冷凍包裝,混合均勻打碎(麵粉,芝麻粉等)",,脂肪酸組成,酪酸(4:0),mg,0,2,,0,48.0克,0
加工調理食品及其他類,樣品基本資料,R2300501,冷凍芝麻包,,Sesame bun,"冷凍包裝,混合均勻打碎(麵粉,芝麻粉等)",,礦物質,鉀,mg,139,1,,139,48.0克,67
加工調理食品及其他類,樣品基本資料,R2300501,冷凍芝麻包,,Sesame bun,"冷凍包裝,混合均勻打碎(麵粉,芝麻粉等)",,一般成分,飽和脂肪,g,4.4,,,4.4,48.0克,2.1
加工調理食品及其他類,樣品基本資料,R2300501,冷凍芝麻包,,Sesame bun,"冷凍包裝,混合均勻打碎(麵粉,芝麻粉等)",,胺基酸組成,精胺酸(Arg),mg,362,1,,362,48.0克,174
加工調理食品及其他類,樣品基本資料,R2300501,冷凍芝麻包,,Sesame bun,"冷凍包裝,混合均勻打碎(麵粉,芝麻粉等)",,維生素A,維生素A總量(IU),I.U.,0,,,0,48.0克,0
加工調理食品及其他類,樣品基本資料,R2300501,冷凍芝麻包,,Sesame bun,"冷凍包裝,混合均勻打碎(麵粉,芝麻粉等)",,維生素B群 & C,維生素B1,mg,0.05,1,,0.05,48.0克,0.02
加工調理食品及其他類,樣品基本資料,R2300501,冷凍芝麻包,,Sesame bun,"冷凍包裝,混合均勻打碎(麵粉,芝麻粉等)",,維生素B群 & C,維生素B12,ug,,0,,,48.0克,
加工調理食品及其他類,樣品基本資料,R2300501,冷凍芝麻包,,Sesame bun,"冷凍包裝,混合均勻打碎(麵粉,芝麻粉等)",,維生素B群 & C,維生素B2,mg,0.07,1,,0.07,48.0克,0.03
加工調理食品及其他類,樣品基本資料,R2300501,冷凍芝麻包,,Sesame bun,"冷凍包裝,混合均勻打碎(麵粉,芝麻粉等)",,維生素B群 & C,維生素B6,mg,0.02,1,,0.02,48.0克,0.01
加工調理食品及其他類,樣品基本資料,R2300501,冷凍芝麻包,,Sesame bun,"冷凍包裝,混合均勻打碎(麵粉,芝麻粉等)",,維生素B群 & C,維生素C,mg,1.3,1,,1.3,48.0克,0.6
加工調理食品及其他類,樣品基本資料,R2300501,冷凍芝麻包,,Sesame bun,"冷凍包裝,混合均勻打碎(麵粉,芝麻粉等)",,維生素D,維生素D2,ug,,0,,,48.0克,
加工調理食品及其他類,樣品基本資料,R2100401,擔仔麵,,,"熟食,加肉燥不含湯,混合均勻打碎",,脂肪酸組成,十三酸(13:0),mg,0,1,,0,0.0克,0
加工調理食品及其他類,樣品基本資料,R2100401,擔仔麵,,,"熟食,加肉燥不含湯,混合均勻打碎",,脂肪酸組成,十五酸(15:0),mg,3,1,,3,0.0克,0
加工調理食品及其他類,樣品基本資料,R2100401,擔仔麵,,,"熟食,加肉燥不含湯,混合均勻打碎",,脂肪酸組成,山酸(22:0),mg,0,1,,0,0.0克,0
加工調理食品及其他類,樣品基本資料,R2100401,擔仔麵,,,"熟食,加肉燥不含湯,混合均勻打碎",,脂肪酸組成,己酸(6:0),mg,0,1,,0,0.0克,0
加工調理食品及其他類,樣品基本資料,R2100401,擔仔麵,,,"熟食,加肉燥不含湯,混合均勻打碎",,其他,反式脂肪,mg,,0,,,0.0克,
加工調理食品及其他類,樣品基本資料,R2100401,擔仔麵,,,"熟食,加肉燥不含湯,混合均勻打碎",,胺基酸組成,天門冬胺酸(Asp),mg,311,1,,311,0.0克,0
加工調理食品及其他類,樣品基本資料,R2100401,擔仔麵,,,"熟食,加肉燥不含湯,混合均勻打碎",,脂肪酸組成,廿二碳五烯酸(22:5),mg,18,1,,18,0.0克,0
加工調理食品及其他類,樣品基本資料,R2100401,擔仔麵,,,"熟食,加肉燥不含湯,混合均勻打碎",,脂肪酸組成,廿二碳六烯酸(22:6),mg,21,1,,21,0.0克,0
加工調理食品及其他類,樣品基本資料,R2100401,擔仔麵,,,"熟食,加肉燥不含湯,混合均勻打碎",,脂肪酸組成,廿四酸(24:0),mg,0,1,,0,0.0克,0
加工調理食品及其他類,樣品基本資料,R2100401,擔仔麵,,,"熟食,加肉燥不含湯,混合均勻打碎",,脂肪酸組成,廿碳五烯酸(20:5),mg,4,1,,4,0.0克,0
加工調理食品及其他類,樣品基本資料,R2100401,擔仔麵,,,"熟食,加肉燥不含湯,混合均勻打碎",,脂肪酸組成,月桂酸(12:0),mg,6,1,,6,0.0克,0
加工調理食品及其他類,樣品基本資料,R2100401,擔仔麵,,,"熟食,加肉燥不含湯,混合均勻打碎",,一般成分,水分,g,76.3,1,,76.3,0.0克,0.0
加工調理食品及其他類,樣品基本資料,R2100401,擔仔麵,,,"熟食,加肉燥不含湯,混合均勻打碎",,胺基酸組成,水解胺基酸總量,mg,4404,,,4404,0.0克,0
加工調理食品及其他類,樣品基本資料,R2100401,擔仔麵,,,"熟食,加肉燥不含湯,混合均勻打碎",,胺基酸組成,丙胺酸(Ala),mg,166,1,,166,0.0克,0
加工調理食品及其他類,樣品基本資料,R2100401,擔仔麵,,,"熟食,加肉燥不含湯,混合均勻打碎",,糖質分析,半乳糖,g,,0,,,0.0克,
加工調理食品及其他類,樣品基本資料,R2100401,擔仔麵,,,"熟食,加肉燥不含湯,混合均勻打碎",,胺基酸組成,甘胺酸(Gly),mg,188,1,,188,0.0克,0
加工調理食品及其他類,樣品基本資料,R2100401,擔仔麵,,,"熟食,加肉燥不含湯,混合均勻打碎",,胺基酸組成,甲硫胺酸(Met),mg,52,1,,52,0.0克,0
加工調理食品及其他類,樣品基本資料,R2100401,擔仔麵,,,"熟食,加肉燥不含湯,混合均勻打碎",,胺基酸組成,白胺酸(Leu),mg,255,1,,255,0.0克,0
加工調理食品及其他類,樣品基本資料,R2100401,擔仔麵,,,"熟食,加肉燥不含湯,混合均勻打碎",,脂肪酸組成,次亞麻油酸(18:3),mg,93,1,,93,0.0克,0
加工調理食品及其他類,樣品基本資料,R2100401,擔仔麵,,,"熟食,加肉燥不含湯,混合均勻打碎",,一般成分,灰分,g,0.9,1,,0.9,0.0克,0.0
加工調理食品及其他類,樣品基本資料,R2100401,擔仔麵,,,"熟食,加肉燥不含湯,混合均勻打碎",,脂肪酸組成,肉豆蔻烯酸(14:1),mg,0,1,,0,0.0克,0
加工調理食品及其他類,樣品基本資料,R2100401,擔仔麵,,,"熟食,加肉燥不含湯,混合均勻打碎",,脂肪酸組成,肉豆蔻酸(14:0),mg,87,1,,87,0.0克,0
加工調理食品及其他類,樣品基本資料,R2100401,擔仔麵,,,"熟食,加肉燥不含湯,混合均勻打碎",,胺基酸組成,色胺酸(Trp),mg,42,1,,42,0.0克,0
加工調理食品及其他類,樣品基本資料,R2100401,擔仔麵,,,"熟食,加肉燥不含湯,混合均勻打碎",,脂肪酸組成,辛酸(8:0),mg,0,1,,0,0.0克,0
加工調理食品及其他類,樣品基本資料,R2100401,擔仔麵,,,"熟食,加肉燥不含湯,混合均勻打碎",,糖質分析,乳糖,g,,0,,,0.0克,
加工調理食品及其他類,樣品基本資料,R2100401,擔仔麵,,,"熟食,加肉燥不含湯,混合均勻打碎",,脂肪酸組成,亞麻油酸(18:2),mg,1196,1,,1196,0.0克,0
加工調理食品及其他類,樣品基本資料,R2100401,擔仔麵,,,"熟食,加肉燥不含湯,混合均勻打碎",,脂肪酸組成,其他脂肪酸,mg,,0,,,0.0克,
加工調理食品及其他類,樣品基本資料,R2100401,擔仔麵,,,"熟食,加肉燥不含湯,混合均勻打碎",,糖質分析,果糖,g,,0,,,0.0克,
加工調理食品及其他類,樣品基本資料,R2100401,擔仔麵,,,"熟食,加肉燥不含湯,混合均勻打碎",,脂肪酸組成,油酸(18:1),mg,2622,1,,2622,0.0克,0
加工調理食品及其他類,樣品基本資料,R2100401,擔仔麵,,,"熟食,加肉燥不含湯,混合均勻打碎",,脂肪酸組成,花生油酸(20:4),mg,17,1,,17,0.0克,0
加工調理食品及其他類,樣品基本資料,R2100401,擔仔麵,,,"熟食,加肉燥不含湯,混合均勻打碎",,脂肪酸組成,花生酸(20:0),mg,15,1,,15,0.0克,0
加工調理食品及其他類,樣品基本資料,R2100401,擔仔麵,,,"熟食,加肉燥不含湯,混合均勻打碎",,脂肪酸組成,芥子酸(22:1),mg,0,1,,0,0.0克,0
加工調理食品及其他類,樣品基本資料,R2100401,擔仔麵,,,"熟食,加肉燥不含湯,混合均勻打碎",,脂肪酸組成,癸酸(10:0),mg,8,1,,8,0.0克,0
加工調理食品及其他類,樣品基本資料,R2100401,擔仔麵,,,"熟食,加肉燥不含湯,混合均勻打碎",,胺基酸組成,苯丙胺酸(Phe),mg,181,1,,181,0.0克,0
加工調理食品及其他類,樣品基本資料,R2100401,擔仔麵,,,"熟食,加肉燥不含湯,混合均勻打碎",,一般成分,修正熱量,kcal,119,,,119,0.0克,0
加工調理食品及其他類,樣品基本資料,R2100401,擔仔麵,,,"熟食,加肉燥不含湯,混合均勻打碎",,胺基酸組成,胱胺酸(Cys),mg,110,1,,110,0.0克,0
加工調理食品及其他類,樣品基本資料,R2100401,擔仔麵,,,"熟食,加肉燥不含湯,混合均勻打碎",,脂肪酸組成,脂肪酸M總量,mg,2816,,,2816,0.0克,0
加工調理食品及其他類,樣品基本資料,R2100401,擔仔麵,,,"熟食,加肉燥不含湯,混合均勻打碎",,脂肪酸組成,脂肪酸P總量,mg,1348,,,1348,0.0克,0
加工調理食品及其他類,樣品基本資料,R2100401,擔仔麵,,,"熟食,加肉燥不含湯,混合均勻打碎",,脂肪酸組成,脂肪酸S總量,mg,2335,,,2335,0.0克,0
加工調理食品及其他類,樣品基本資料,R2100401,擔仔麵,,,"熟食,加肉燥不含湯,混合均勻打碎",,其他,酒精含量,g,,0,,,0.0克,
加工調理食品及其他類,樣品基本資料,R2100401,擔仔麵,,,"熟食,加肉燥不含湯,混合均勻打碎",,胺基酸組成,異白胺酸(Ile),mg,135,1,,135,0.0克,0
加工調理食品及其他類,樣品基本資料,R2100401,擔仔麵,,,"熟食,加肉燥不含湯,混合均勻打碎",,一般成分,粗脂肪,g,6.5,1,,6.5,0.0克,0.0
加工調理食品及其他類,樣品基本資料,R2100401,擔仔麵,,,"熟食,加肉燥不含湯,混合均勻打碎",,一般成分,粗蛋白,g,4.4,1,,4.4,0.0克,0.0
加工調理食品及其他類,樣品基本資料,R2100401,擔仔麵,,,"熟食,加肉燥不含湯,混合均勻打碎",,胺基酸組成,組胺酸(His),mg,103,1,,103,0.0克,0
加工調理食品及其他類,樣品基本資料,R2100401,擔仔麵,,,"熟食,加肉燥不含湯,混合均勻打碎",,胺基酸組成,脯胺酸(Pro),mg,399,1,,399,0.0克,0
加工調理食品及其他類,樣品基本資料,R2100401,擔仔麵,,,"熟食,加肉燥不含湯,混合均勻打碎",,糖質分析,麥芽糖,g,,0,,,0.0克,
加工調理食品及其他類,樣品基本資料,R2100401,擔仔麵,,,"熟食,加肉燥不含湯,混合均勻打碎",,脂肪酸組成,棕櫚烯酸(16:1),mg,140,1,,140,0.0克,0
加工調理食品及其他類,樣品基本資料,R2100401,擔仔麵,,,"熟食,加肉燥不含湯,混合均勻打碎",,脂肪酸組成,棕櫚酸(16:0),mg,1476,1,,1476,0.0克,0
加工調理食品及其他類,樣品基本資料,R2100401,擔仔麵,,,"熟食,加肉燥不含湯,混合均勻打碎",,脂肪酸組成,硬脂酸(18:0),mg,740,1,,740,0.0克,0
加工調理食品及其他類,樣品基本資料,R2100401,擔仔麵,,,"熟食,加肉燥不含湯,混合均勻打碎",,胺基酸組成,絲胺酸(Ser),mg,175,1,,175,0.0克,0
加工調理食品及其他類,樣品基本資料,R2100401,擔仔麵,,,"熟食,加肉燥不含湯,混合均勻打碎",,維生素B群 & C,菸鹼素,mg,0.70,1,,0.70,0.0克,0.00
加工調理食品及其他類,樣品基本資料,R2100401,擔仔麵,,,"熟食,加肉燥不含湯,混合均勻打碎",,維生素A,視網醇,ug,3,1,,3,0.0克,0
加工調理食品及其他類,樣品基本資料,R2100401,擔仔麵,,,"熟食,加肉燥不含湯,混合均勻打碎",,維生素A,視網醇當量(RE),ug,3,,,3,0.0克,0
加工調理食品及其他類,樣品基本資料,R2100401,擔仔麵,,,"熟食,加肉燥不含湯,混合均勻打碎",,胺基酸組成,酥胺酸(Thr),mg,121,1,,121,0.0克,0
加工調理食品及其他類,樣品基本資料,R2100401,擔仔麵,,,"熟食,加肉燥不含湯,混合均勻打碎",,礦物質,鈣,mg,6,1,,6,0.0克,0
加工調理食品及其他類,樣品基本資料,R2100401,擔仔麵,,,"熟食,加肉燥不含湯,混合均勻打碎",,礦物質,鈉,mg,312,1,,312,0.0克,0
加工調理食品及其他類,樣品基本資料,R2100401,擔仔麵,,,"熟食,加肉燥不含湯,混合均勻打碎",,維生素B群 & C,葉酸,ug,9.0,1,,9.0,0.0克,0.0
加工調理食品及其他類,樣品基本資料,R2100401,擔仔麵,,,"熟食,加肉燥不含湯,混合均勻打碎",,糖質分析,葡萄糖,g,,0,,,0.0克,
加工調理食品及其他類,樣品基本資料,R2100401,擔仔麵,,,"熟食,加肉燥不含湯,混合均勻打碎",,胺基酸組成,酪胺酸(Tyr),mg,125,1,,125,0.0克,0
加工調理食品及其他類,樣品基本資料,R2100401,擔仔麵,,,"熟食,加肉燥不含湯,混合均勻打碎",,脂肪酸組成,酪酸(4:0),mg,0,1,,0,0.0克,0
加工調理食品及其他類,樣品基本資料,R2100401,擔仔麵,,,"熟食,加肉燥不含湯,混合均勻打碎",,礦物質,鉀,mg,83,1,,83,0.0克,0
加工調理食品及其他類,樣品基本資料,R2100401,擔仔麵,,,"熟食,加肉燥不含湯,混合均勻打碎",,一般成分,飽和脂肪,g,2.3,,,2.3,0.0克,0.0
加工調理食品及其他類,樣品基本資料,R2100401,擔仔麵,,,"熟食,加肉燥不含湯,混合均勻打碎",,胺基酸組成,精胺酸(Arg),mg,213,1,,213,0.0克,0
加工調理食品及其他類,樣品基本資料,R2100401,擔仔麵,,,"熟食,加肉燥不含湯,混合均勻打碎",,維生素A,維生素A總量(IU),I.U.,10,,,10,0.0克,0
加工調理食品及其他類,樣品基本資料,R2100401,擔仔麵,,,"熟食,加肉燥不含湯,混合均勻打碎",,維生素B群 & C,維生素B1,mg,0.03,1,,0.03,0.0克,0.00
加工調理食品及其他類,樣品基本資料,R2100401,擔仔麵,,,"熟食,加肉燥不含湯,混合均勻打碎",,維生素B群 & C,維生素B12,ug,0.33,1,,0.33,0.0克,0.00
加工調理食品及其他類,樣品基本資料,R2100401,擔仔麵,,,"熟食,加肉燥不含湯,混合均勻打碎",,維生素B群 & C,維生素B2,mg,0.07,1,,0.07,0.0克,0.00
加工調理食品及其他類,樣品基本資料,R2100401,擔仔麵,,,"熟食,加肉燥不含湯,混合均勻打碎",,維生素B群 & C,維生素B6,mg,0.12,1,,0.12,0.0克,0.00
加工調理食品及其他類,樣品基本資料,R2100401,擔仔麵,,,"熟食,加肉燥不含湯,混合均勻打碎",,維生素B群 & C,維生素C,mg,0.0,1,,0.0,0.0克,0.0
加工調理食品及其他類,樣品基本資料,R2100401,擔仔麵,,,"熟食,加肉燥不含湯,混合均勻打碎",,維生素D,維生素D2,ug,,0,,,0.0克,
加工調理食品及其他類,樣品基本資料,R2100401,擔仔麵,,,"熟食,加肉燥不含湯,混合均勻打碎",,維生素D,維生素D3,ug,,0,,,0.0克,
加工調理食品及其他類,樣品基本資料,R2100401,擔仔麵,,,"熟食,加肉燥不含湯,混合均勻打碎",,維生素D,維生素D總量(IU),I.U.,,,,,0.0克,
加工調理食品及其他類,樣品基本資料,R2100401,擔仔麵,,,"熟食,加肉燥不含湯,混合均勻打碎",,維生素D,維生素D總量(ug),ug,,,,,0.0克,
加工調理食品及其他類,樣品基本資料,R2100401,擔仔麵,,,"熟食,加肉燥不含湯,混合均勻打碎",,維生素E,維生素E總量,mg,0.57,,,0.57,0.0克,0.00
加工調理食品及其他類,樣品基本資料,R2100401,擔仔麵,,,"熟食,加肉燥不含湯,混合均勻打碎",,維生素K,維生素K1,ug,,0,,,0.0克,
加工調理食品及其他類,樣品基本資料,R2100401,擔仔麵,,,"熟食,加肉燥不含湯,混合均勻打碎",,維生素K,維生素K2(MK-4),ug,,0,,,0.0克,